IHSOAH,IHSOAH,IHSOAH,IHSOAH,IHSOAH,IHSOAH,IHSOAH,IHSOAH,IHSOAH,IHSOAH,IHSOAH,3KR1VR,3KR1VR,3KR1VR,3KR1VR,3KR1VR,3KR1VR,3KR1VR,3KR1VR,3KR1VR,3KR1VR,3KR1VR,3KR1VR,3KR1VR,3KR1VR,3KR1VR,3KR1VR,3KR1VR,3KR1VR,3KR1VR,3KR1VR,3KR1VR,3KR1VR,3KR1VR,3KR1VR,3KR1VR,K5QRU3,K5QRU3,K5QRU3,K5QRU3,K5QRU3,K5QRU3,K5QRU3,K5QRU3,K5QRU3,K5QRU3,K5QRU3,K5QRU3,K5QRU3,WYYCHV,WYYCHV,URMTZ0,URMTZ0,URMTZ0,URMTZ0,URMTZ0,URMTZ0,URMTZ0,3VZ7G2,3VZ7G2,3VZ7G2,3VZ7G2,3VZ7G2,3VZ7G2,3VZ7G2,3VZ7G2,3VZ7G2,UTXF50,UTXF50,UTXF50,FYAZLN,FYAZLN,FYAZLN,FYAZLN,FYAZLN,FYAZLN,FYAZLN,FYAZLN,FYAZLN,FYAZLN
JWYGIB,JWYGIB,JWYGIB,JWYGIB,JWYGIB,JWYGIB,JWYGIB,JWYGIB,JWYGIB,JWYGIB,JWYGIB,JWYGIB,JWYGIB,JWYGIB,JWYGIB,JWYGIB,JWYGIB,JWYGIB,JWYGIB,JWYGIB,JWYGIB,JWYGIB,JWYGIB,JWYGIB,JWYGIB,JWYGIB,K00WUH,K00WUH,K00WUH,K00WUH,9EODDA,9EODDA,9EODDA,9EODDA,9EODDA,,K5QRU3,K5QRU3,K5QRU3,K5QRU3,K5QRU3,K5QRU3,K5QRU3,K5QRU3,K5QRU3,K5QRU3,K5QRU3,K5QRU3,K5QRU3,WYYCHV,WYYCHV,URMTZ0,URMTZ0,URMTZ0,URMTZ0,URMTZ0,URMTZ0,URMTZ0,3VZ7G2,3VZ7G2,3VZ7G2,3VZ7G2,3VZ7G2,3VZ7G2,3VZ7G2,3VZ7G2,3VZ7G2,UTXF50,UTXF50,UTXF50,FYAZLN,FYAZLN,FYAZLN,FYAZLN,FYAZLN,FYAZLN,FYAZLN,FYAZLN,FYAZLN,FYAZLN
JWYGIB,JWYGIB,JWYGIB,JWYGIB,JWYGIB,JWYGIB,JWYGIB,JWYGIB,JWYGIB,JWYGIB,JWYGIB,JWYGIB,JWYGIB,JWYGIB,JWYGIB,JWYGIB,JWYGIB,JWYGIB,JWYGIB,JWYGIB,JWYGIB,JWYGIB,JWYGIB,JWYGIB,JWYGIB,JWYGIB,K00WUH,K00WUH,K00WUH,K00WUH,9EODDA,9EODDA,9EODDA,9EODDA,9EODDA,,K5QRU3,K5QRU3,K5QRU3,K5QRU3,K5QRU3,K5QRU3,K5QRU3,K5QRU3,K5QRU3,K5QRU3,K5QRU3,K5QRU3,K5QRU3,WYYCHV,WYYCHV,URMTZ0,URMTZ0,URMTZ0,URMTZ0,URMTZ0,URMTZ0,URMTZ0,3VZ7G2,3VZ7G2,3VZ7G2,3VZ7G2,3VZ7G2,3VZ7G2,3VZ7G2,3VZ7G2,3VZ7G2,UTXF50,UTXF50,UTXF50,FYAZLN,FYAZLN,FYAZLN,FYAZLN,FYAZLN,FYAZLN,FYAZLN,FYAZLN,FYAZLN,FYAZLN
JWYGIB,JWYGIB,JWYGIB,JWYGIB,JWYGIB,JWYGIB,JWYGIB,JWYGIB,JWYGIB,JWYGIB,JWYGIB,JWYGIB,JWYGIB,JWYGIB,JWYGIB,JWYGIB,JWYGIB,JWYGIB,JWYGIB,JWYGIB,JWYGIB,JWYGIB,JWYGIB,JWYGIB,JWYGIB,JWYGIB,K00WUH,K00WUH,K00WUH,K00WUH,9EODDA,9EODDA,9EODDA,9EODDA,9EODDA,,K5QRU3,K5QRU3,K5QRU3,K5QRU3,K5QRU3,K5QRU3,K5QRU3,K5QRU3,K5QRU3,K5QRU3,K5QRU3,K5QRU3,K5QRU3,WYYCHV,WYYCHV,URMTZ0,URMTZ0,URMTZ0,URMTZ0,URMTZ0,URMTZ0,URMTZ0,3VZ7G2,3VZ7G2,3VZ7G2,3VZ7G2,3VZ7G2,3VZ7G2,3VZ7G2,3VZ7G2,3VZ7G2,UTXF50,UTXF50,UTXF50,FYAZLN,FYAZLN,FYAZLN,FYAZLN,FYAZLN,FYAZLN,FYAZLN,FYAZLN,FYAZLN,FYAZLN
JWYGIB,JWYGIB,JWYGIB,JWYGIB,JWYGIB,JWYGIB,JWYGIB,JWYGIB,JWYGIB,JWYGIB,JWYGIB,JWYGIB,JWYGIB,JWYGIB,JWYGIB,JWYGIB,JWYGIB,JWYGIB,JWYGIB,JWYGIB,JWYGIB,JWYGIB,JWYGIB,JWYGIB,JWYGIB,JWYGIB,K00WUH,K00WUH,K00WUH,K00WUH,9EODDA,9EODDA,9EODDA,9EODDA,9EODDA,,K5QRU3,K5QRU3,K5QRU3,K5QRU3,K5QRU3,K5QRU3,K5QRU3,K5QRU3,K5QRU3,K5QRU3,K5QRU3,K5QRU3,K5QRU3,WYYCHV,WYYCHV,URMTZ0,URMTZ0,URMTZ0,URMTZ0,URMTZ0,URMTZ0,URMTZ0,3VZ7G2,3VZ7G2,3VZ7G2,3VZ7G2,3VZ7G2,3VZ7G2,3VZ7G2,3VZ7G2,3VZ7G2,UTXF50,UTXF50,UTXF50,FYAZLN,FYAZLN,FYAZLN,FYAZLN,FYAZLN,FYAZLN,FYAZLN,FYAZLN,FYAZLN,FYAZLN
WMBL0C,WMBL0C,WMBL0C,WMBL0C,WMBL0C,WMBL0C,WMBL0C,WMBL0C,WMBL0C,WMBL0C,WMBL0C,WMBL0C,WMBL0C,WMBL0C,WMBL0C,WMBL0C,W3PK51,W3PK51,W3PK51,W3PK51,W3PK51,W3PK51,,,,,K00WUH,K00WUH,K00WUH,K00WUH,9EODDA,9EODDA,9EODDA,9EODDA,9EODDA,1NB3TE,1NB3TE,1NB3TE,1NB3TE,1NB3TE,1NB3TE,1NB3TE,1NB3TE,1NB3TE,1NB3TE,,,,,WYYCHV,WYYCHV,URMTZ0,URMTZ0,URMTZ0,URMTZ0,URMTZ0,URMTZ0,URMTZ0,3VZ7G2,3VZ7G2,3VZ7G2,3VZ7G2,3VZ7G2,3VZ7G2,3VZ7G2,3VZ7G2,3VZ7G2,UTXF50,UTXF50,UTXF50,FYAZLN,FYAZLN,FYAZLN,FYAZLN,FYAZLN,FYAZLN,FYAZLN,FYAZLN,FYAZLN,FYAZLN
WMBL0C,WMBL0C,WMBL0C,WMBL0C,WMBL0C,WMBL0C,WMBL0C,WMBL0C,WMBL0C,WMBL0C,WMBL0C,WMBL0C,WMBL0C,WMBL0C,WMBL0C,WMBL0C,W3PK51,W3PK51,W3PK51,W3PK51,W3PK51,W3PK51,,,,,K00WUH,K00WUH,K00WUH,K00WUH,9EODDA,9EODDA,9EODDA,9EODDA,9EODDA,1NB3TE,1NB3TE,1NB3TE,1NB3TE,1NB3TE,1NB3TE,1NB3TE,1NB3TE,1NB3TE,1NB3TE,,,,,WYYCHV,WYYCHV,URMTZ0,URMTZ0,URMTZ0,URMTZ0,URMTZ0,URMTZ0,URMTZ0,3VZ7G2,3VZ7G2,3VZ7G2,3VZ7G2,3VZ7G2,3VZ7G2,3VZ7G2,3VZ7G2,3VZ7G2,UTXF50,UTXF50,UTXF50,FYAZLN,FYAZLN,FYAZLN,FYAZLN,FYAZLN,FYAZLN,FYAZLN,FYAZLN,FYAZLN,FYAZLN
WMBL0C,WMBL0C,WMBL0C,WMBL0C,WMBL0C,WMBL0C,WMBL0C,WMBL0C,WMBL0C,WMBL0C,WMBL0C,WMBL0C,WMBL0C,WMBL0C,WMBL0C,WMBL0C,W3PK51,W3PK51,W3PK51,W3PK51,W3PK51,W3PK51,,,,,K00WUH,K00WUH,K00WUH,K00WUH,9EODDA,9EODDA,9EODDA,9EODDA,9EODDA,1NB3TE,1NB3TE,1NB3TE,1NB3TE,1NB3TE,1NB3TE,1NB3TE,1NB3TE,1NB3TE,1NB3TE,,,,,WYYCHV,WYYCHV,URMTZ0,URMTZ0,URMTZ0,URMTZ0,URMTZ0,URMTZ0,URMTZ0,3VZ7G2,3VZ7G2,3VZ7G2,3VZ7G2,3VZ7G2,3VZ7G2,3VZ7G2,3VZ7G2,3VZ7G2,UTXF50,UTXF50,UTXF50,FYAZLN,FYAZLN,FYAZLN,FYAZLN,FYAZLN,FYAZLN,FYAZLN,FYAZLN,FYAZLN,FYAZLN
WMBL0C,WMBL0C,WMBL0C,WMBL0C,WMBL0C,WMBL0C,WMBL0C,WMBL0C,WMBL0C,WMBL0C,WMBL0C,WMBL0C,WMBL0C,WMBL0C,WMBL0C,WMBL0C,W3PK51,W3PK51,W3PK51,W3PK51,W3PK51,W3PK51,,,,,K00WUH,K00WUH,K00WUH,K00WUH,9EODDA,9EODDA,9EODDA,9EODDA,9EODDA,1NB3TE,1NB3TE,1NB3TE,1NB3TE,1NB3TE,1NB3TE,1NB3TE,1NB3TE,1NB3TE,1NB3TE,,,,,WYYCHV,WYYCHV,URMTZ0,URMTZ0,URMTZ0,URMTZ0,URMTZ0,URMTZ0,URMTZ0,3VZ7G2,3VZ7G2,3VZ7G2,3VZ7G2,3VZ7G2,3VZ7G2,3VZ7G2,3VZ7G2,3VZ7G2,UTXF50,UTXF50,UTXF50,FYAZLN,FYAZLN,FYAZLN,FYAZLN,FYAZLN,FYAZLN,FYAZLN,FYAZLN,FYAZLN,FYAZLN
WMBL0C,WMBL0C,WMBL0C,WMBL0C,WMBL0C,WMBL0C,WMBL0C,WMBL0C,WMBL0C,WMBL0C,WMBL0C,WMBL0C,WMBL0C,WMBL0C,WMBL0C,WMBL0C,W3PK51,W3PK51,W3PK51,W3PK51,W3PK51,W3PK51,,,,,K00WUH,K00WUH,K00WUH,K00WUH,9EODDA,9EODDA,9EODDA,9EODDA,9EODDA,1NB3TE,1NB3TE,1NB3TE,1NB3TE,1NB3TE,1NB3TE,1NB3TE,1NB3TE,1NB3TE,1NB3TE,,,,,WYYCHV,WYYCHV,URMTZ0,URMTZ0,URMTZ0,URMTZ0,URMTZ0,URMTZ0,URMTZ0,3VZ7G2,3VZ7G2,3VZ7G2,3VZ7G2,3VZ7G2,3VZ7G2,3VZ7G2,3VZ7G2,3VZ7G2,UTXF50,UTXF50,UTXF50,FYAZLN,FYAZLN,FYAZLN,FYAZLN,FYAZLN,FYAZLN,FYAZLN,FYAZLN,FYAZLN,FYAZLN
WMBL0C,WMBL0C,WMBL0C,WMBL0C,WMBL0C,WMBL0C,WMBL0C,WMBL0C,WMBL0C,WMBL0C,WMBL0C,WMBL0C,WMBL0C,WMBL0C,WMBL0C,WMBL0C,W3PK51,W3PK51,W3PK51,W3PK51,W3PK51,W3PK51,,,,,K00WUH,K00WUH,K00WUH,K00WUH,9EODDA,9EODDA,9EODDA,9EODDA,9EODDA,1NB3TE,1NB3TE,1NB3TE,1NB3TE,1NB3TE,1NB3TE,1NB3TE,1NB3TE,1NB3TE,1NB3TE,,,,,WYYCHV,WYYCHV,URMTZ0,URMTZ0,URMTZ0,URMTZ0,URMTZ0,URMTZ0,URMTZ0,3VZ7G2,3VZ7G2,3VZ7G2,3VZ7G2,3VZ7G2,3VZ7G2,3VZ7G2,3VZ7G2,3VZ7G2,UTXF50,UTXF50,UTXF50,FYAZLN,FYAZLN,FYAZLN,FYAZLN,FYAZLN,FYAZLN,FYAZLN,FYAZLN,FYAZLN,FYAZLN
WMBL0C,WMBL0C,WMBL0C,WMBL0C,WMBL0C,WMBL0C,WMBL0C,WMBL0C,WMBL0C,WMBL0C,WMBL0C,WMBL0C,WMBL0C,WMBL0C,WMBL0C,WMBL0C,W3PK51,W3PK51,W3PK51,W3PK51,W3PK51,W3PK51,,,,,K00WUH,K00WUH,K00WUH,K00WUH,9EODDA,9EODDA,9EODDA,9EODDA,9EODDA,1NB3TE,1NB3TE,1NB3TE,1NB3TE,1NB3TE,1NB3TE,1NB3TE,1NB3TE,1NB3TE,1NB3TE,,,,,WYYCHV,WYYCHV,URMTZ0,URMTZ0,URMTZ0,URMTZ0,URMTZ0,URMTZ0,URMTZ0,,,,,,,,,,UTXF50,UTXF50,UTXF50,FYAZLN,FYAZLN,FYAZLN,FYAZLN,FYAZLN,FYAZLN,FYAZLN,FYAZLN,FYAZLN,FYAZLN
WMBL0C,WMBL0C,WMBL0C,WMBL0C,WMBL0C,WMBL0C,WMBL0C,WMBL0C,WMBL0C,WMBL0C,WMBL0C,WMBL0C,WMBL0C,WMBL0C,WMBL0C,WMBL0C,W3PK51,W3PK51,W3PK51,W3PK51,W3PK51,W3PK51,,,,,K00WUH,K00WUH,K00WUH,K00WUH,9EODDA,9EODDA,9EODDA,9EODDA,9EODDA,1NB3TE,1NB3TE,1NB3TE,1NB3TE,1NB3TE,1NB3TE,1NB3TE,1NB3TE,1NB3TE,1NB3TE,,,,,WYYCHV,WYYCHV,URMTZ0,URMTZ0,URMTZ0,URMTZ0,URMTZ0,URMTZ0,URMTZ0,,,,,,,,,,UTXF50,UTXF50,UTXF50,,,,,,,,,,
WMBL0C,WMBL0C,WMBL0C,WMBL0C,WMBL0C,WMBL0C,WMBL0C,WMBL0C,WMBL0C,WMBL0C,WMBL0C,WMBL0C,WMBL0C,WMBL0C,WMBL0C,WMBL0C,W3PK51,W3PK51,W3PK51,W3PK51,W3PK51,W3PK51,,,,,K00WUH,K00WUH,K00WUH,K00WUH,9EODDA,9EODDA,9EODDA,9EODDA,9EODDA,1NB3TE,1NB3TE,1NB3TE,1NB3TE,1NB3TE,1NB3TE,1NB3TE,1NB3TE,1NB3TE,1NB3TE,,,,,WYYCHV,WYYCHV,URMTZ0,URMTZ0,URMTZ0,URMTZ0,URMTZ0,URMTZ0,URMTZ0,,,,,,,,,,UTXF50,UTXF50,UTXF50,,,,,,,,,,
WMBL0C,WMBL0C,WMBL0C,WMBL0C,WMBL0C,WMBL0C,WMBL0C,WMBL0C,WMBL0C,WMBL0C,WMBL0C,WMBL0C,WMBL0C,WMBL0C,WMBL0C,WMBL0C,W3PK51,W3PK51,W3PK51,W3PK51,W3PK51,W3PK51,,,,,K00WUH,K00WUH,K00WUH,K00WUH,9EODDA,9EODDA,9EODDA,9EODDA,9EODDA,1NB3TE,1NB3TE,1NB3TE,1NB3TE,1NB3TE,1NB3TE,1NB3TE,1NB3TE,1NB3TE,1NB3TE,,,,,WYYCHV,WYYCHV,,,,,,,,,,,,,,,,,UTXF50,UTXF50,UTXF50,,,,,,,,,,
,,,,,,,,,,,,,,,,W3PK51,W3PK51,W3PK51,W3PK51,W3PK51,W3PK51,,,,,K00WUH,K00WUH,K00WUH,K00WUH,9EODDA,9EODDA,9EODDA,9EODDA,9EODDA,1NB3TE,1NB3TE,1NB3TE,1NB3TE,1NB3TE,1NB3TE,1NB3TE,1NB3TE,1NB3TE,1NB3TE,,,,,WYYCHV,WYYCHV,,,,,,,,,,,,,,,,,UTXF50,UTXF50,UTXF50,,,,,,,,,,
,,,,,,,,,,,,,,,,W3PK51,W3PK51,W3PK51,W3PK51,W3PK51,W3PK51,,,,,K00WUH,K00WUH,K00WUH,K00WUH,9EODDA,9EODDA,9EODDA,9EODDA,9EODDA,1NB3TE,1NB3TE,1NB3TE,1NB3TE,1NB3TE,1NB3TE,1NB3TE,1NB3TE,1NB3TE,1NB3TE,,,,,WYYCHV,WYYCHV,,,,,,,,,,,,,,,,,UTXF50,UTXF50,UTXF50,,,,,,,,,,
,,,,,,,,,,,,,,,,W3PK51,W3PK51,W3PK51,W3PK51,W3PK51,W3PK51,,,,,K00WUH,K00WUH,K00WUH,K00WUH,9EODDA,9EODDA,9EODDA,9EODDA,9EODDA,1NB3TE,1NB3TE,1NB3TE,1NB3TE,1NB3TE,1NB3TE,1NB3TE,1NB3TE,1NB3TE,1NB3TE,,,,,WYYCHV,WYYCHV,,,,,,,,,,,,,,,,,UTXF50,UTXF50,UTXF50,,,,,,,,,,
,,,,,,,,,,,,,,,,W3PK51,W3PK51,W3PK51,W3PK51,W3PK51,W3PK51,,,,,K00WUH,K00WUH,K00WUH,K00WUH,9EODDA,9EODDA,9EODDA,9EODDA,9EODDA,1NB3TE,1NB3TE,1NB3TE,1NB3TE,1NB3TE,1NB3TE,1NB3TE,1NB3TE,1NB3TE,1NB3TE,,,,,WYYCHV,WYYCHV,,,,,,,,,,,,,,,,,UTXF50,UTXF50,UTXF50,,,,,,,,,,
,,,,,,,,,,,,,,,,W3PK51,W3PK51,W3PK51,W3PK51,W3PK51,W3PK51,,,,,K00WUH,K00WUH,K00WUH,K00WUH,9EODDA,9EODDA,9EODDA,9EODDA,9EODDA,1NB3TE,1NB3TE,1NB3TE,1NB3TE,1NB3TE,1NB3TE,1NB3TE,1NB3TE,1NB3TE,1NB3TE,,,,,WYYCHV,WYYCHV,,,,,,,,,,,,,,,,,UTXF50,UTXF50,UTXF50,,,,,,,,,,
,,,,,,,,,,,,,,,,W3PK51,W3PK51,W3PK51,W3PK51,W3PK51,W3PK51,,,,,K00WUH,K00WUH,K00WUH,K00WUH,9EODDA,9EODDA,9EODDA,9EODDA,9EODDA,1NB3TE,1NB3TE,1NB3TE,1NB3TE,1NB3TE,1NB3TE,1NB3TE,1NB3TE,1NB3TE,1NB3TE,,,,,WYYCHV,WYYCHV,,,,,,,,,,,,,,,,,UTXF50,UTXF50,UTXF50,,,,,,,,,,
,,,,,,,,,,,,,,,,W3PK51,W3PK51,W3PK51,W3PK51,W3PK51,W3PK51,,,,,K00WUH,K00WUH,K00WUH,K00WUH,9EODDA,9EODDA,9EODDA,9EODDA,9EODDA,1NB3TE,1NB3TE,1NB3TE,1NB3TE,1NB3TE,1NB3TE,1NB3TE,1NB3TE,1NB3TE,1NB3TE,,,,,WYYCHV,WYYCHV,,,,,,,,,,,,,,,,,UTXF50,UTXF50,UTXF50,,,,,,,,,,
,,,,,,,,,,,,,,,,W3PK51,W3PK51,W3PK51,W3PK51,W3PK51,W3PK51,,,,,K00WUH,K00WUH,K00WUH,K00WUH,9EODDA,9EODDA,9EODDA,9EODDA,9EODDA,1NB3TE,1NB3TE,1NB3TE,1NB3TE,1NB3TE,1NB3TE,1NB3TE,1NB3TE,1NB3TE,1NB3TE,,,,,WYYCHV,WYYCHV,,,,,,,,,,,,,,,,,UTXF50,UTXF50,UTXF50,,,,,,,,,,
,,,,,,,,,,,,,,,,W3PK51,W3PK51,W3PK51,W3PK51,W3PK51,W3PK51,,,,,K00WUH,K00WUH,K00WUH,K00WUH,9EODDA,9EODDA,9EODDA,9EODDA,9EODDA,,,,,,,,,,,,,,,WYYCHV,WYYCHV,,,,,,,,,,,,,,,,,UTXF50,UTXF50,UTXF50,,,,,,,,,,
,,,,,,,,,,,,,,,,W3PK51,W3PK51,W3PK51,W3PK51,W3PK51,W3PK51,,,,,K00WUH,K00WUH,K00WUH,K00WUH,9EODDA,9EODDA,9EODDA,9EODDA,9EODDA,,,,,,,,,,,,,,,WYYCHV,WYYCHV,,,,,,,,,,,,,,,,,UTXF50,UTXF50,UTXF50,,,,,,,,,,
,,,,,,,,,,,,,,,,W3PK51,W3PK51,W3PK51,W3PK51,W3PK51,W3PK51,,,,,K00WUH,K00WUH,K00WUH,K00WUH,9EODDA,9EODDA,9EODDA,9EODDA,9EODDA,,,,,,,,,,,,,,,WYYCHV,WYYCHV,,,,,,,,,,,,,,,,,UTXF50,UTXF50,UTXF50,,,,,,,,,,
,,,,,,,,,,,,,,,,W3PK51,W3PK51,W3PK51,W3PK51,W3PK51,W3PK51,,,,,K00WUH,K00WUH,K00WUH,K00WUH,9EODDA,9EODDA,9EODDA,9EODDA,9EODDA,,,,,,,,,,,,,,,WYYCHV,WYYCHV,,,,,,,,,,,,,,,,,UTXF50,UTXF50,UTXF50,,,,,,,,,,
,,,,,,,,,,,,,,,,W3PK51,W3PK51,W3PK51,W3PK51,W3PK51,W3PK51,,,,,K00WUH,K00WUH,K00WUH,K00WUH,9EODDA,9EODDA,9EODDA,9EODDA,9EODDA,,,,,,,,,,,,,,,WYYCHV,WYYCHV,,,,,,,,,,,,,,,,,UTXF50,UTXF50,UTXF50,,,,,,,,,,
,,,,,,,,,,,,,,,,W3PK51,W3PK51,W3PK51,W3PK51,W3PK51,W3PK51,,,,,K00WUH,K00WUH,K00WUH,K00WUH,9EODDA,9EODDA,9EODDA,9EODDA,9EODDA,,,,,,,,,,,,,,,WYYCHV,WYYCHV,,,,,,,,,,,,,,,,,UTXF50,UTXF50,UTXF50,,,,,,,,,,
,,,,,,,,,,,,,,,,W3PK51,W3PK51,W3PK51,W3PK51,W3PK51,W3PK51,,,,,K00WUH,K00WUH,K00WUH,K00WUH,9EODDA,9EODDA,9EODDA,9EODDA,9EODDA,,,,,,,,,,,,,,,WYYCHV,WYYCHV,,,,,,,,,,,,,,,,,UTXF50,UTXF50,UTXF50,,,,,,,,,,
,,,,,,,,,,,,,,,,W3PK51,W3PK51,W3PK51,W3PK51,W3PK51,W3PK51,,,,,K00WUH,K00WUH,K00WUH,K00WUH,,,,,,,,,,,,,,,,,,,,WYYCHV,WYYCHV,,,,,,,,,,,,,,,,,UTXF50,UTXF50,UTXF50,,,,,,,,,,
,,,,,,,,,,,,,,,,W3PK51,W3PK51,W3PK51,W3PK51,W3PK51,W3PK51,,,,,K00WUH,K00WUH,K00WUH,K00WUH,,,,,,,,,,,,,,,,,,,,WYYCHV,WYYCHV,,,,,,,,,,,,,,,,,UTXF50,UTXF50,UTXF50,,,,,,,,,,
,,,,,,,,,,,,,,,,W3PK51,W3PK51,W3PK51,W3PK51,W3PK51,W3PK51,,,,,K00WUH,K00WUH,K00WUH,K00WUH,,,,,,,,,,,,,,,,,,,,WYYCHV,WYYCHV,,,,,,,,,,,,,,,,,UTXF50,UTXF50,UTXF50,,,,,,,,,,
EYRTZL,EYRTZL,EYRTZL,EYRTZL,EYRTZL,EYRTZL,EYRTZL,EYRTZL,EYRTZL,EYRTZL,EYRTZL,EYRTZL,EYRTZL,EYRTZL,EYRTZL,EYRTZL,EYRTZL,EYRTZL,EYRTZL,EYRTZL,EYRTZL,,,,,,K00WUH,K00WUH,K00WUH,K00WUH,,,,,,,,,,,,,,,,,,,,WYYCHV,WYYCHV,,,,,,,,,,,,,,,,,UTXF50,UTXF50,UTXF50,,,,,,,,,,
EYRTZL,EYRTZL,EYRTZL,EYRTZL,EYRTZL,EYRTZL,EYRTZL,EYRTZL,EYRTZL,EYRTZL,EYRTZL,EYRTZL,EYRTZL,EYRTZL,EYRTZL,EYRTZL,EYRTZL,EYRTZL,EYRTZL,EYRTZL,EYRTZL,,,,,,K00WUH,K00WUH,K00WUH,K00WUH,,,,,,,,,,,,,,,,,,,,WYYCHV,WYYCHV,,,,,,,,,,,,,,,,,,,,,,,,,,,,,
EYRTZL,EYRTZL,EYRTZL,EYRTZL,EYRTZL,EYRTZL,EYRTZL,EYRTZL,EYRTZL,EYRTZL,EYRTZL,EYRTZL,EYRTZL,EYRTZL,EYRTZL,EYRTZL,EYRTZL,EYRTZL,EYRTZL,EYRTZL,EYRTZL,7Y2PFL,7Y2PFL,7Y2PFL,7Y2PFL,7Y2PFL,7Y2PFL,7Y2PFL,7Y2PFL,7Y2PFL,7Y2PFL,7Y2PFL,7Y2PFL,7Y2PFL,7Y2PFL,7Y2PFL,7Y2PFL,7Y2PFL,7Y2PFL,7Y2PFL,7Y2PFL,7Y2PFL,7Y2PFL,7Y2PFL,7Y2PFL,7Y2PFL,7Y2PFL,7Y2PFL,7Y2PFL,7Y2PFL,7Y2PFL,7Y2PFL,7Y2PFL,7Y2PFL,7Y2PFL,7Y2PFL,,,,,,,,,,,,,,,,,,,,,,,,
EYRTZL,EYRTZL,EYRTZL,EYRTZL,EYRTZL,EYRTZL,EYRTZL,EYRTZL,EYRTZL,EYRTZL,EYRTZL,EYRTZL,EYRTZL,EYRTZL,EYRTZL,EYRTZL,EYRTZL,EYRTZL,EYRTZL,EYRTZL,EYRTZL,7Y2PFL,7Y2PFL,7Y2PFL,7Y2PFL,7Y2PFL,7Y2PFL,7Y2PFL,7Y2PFL,7Y2PFL,7Y2PFL,7Y2PFL,7Y2PFL,7Y2PFL,7Y2PFL,7Y2PFL,7Y2PFL,7Y2PFL,7Y2PFL,7Y2PFL,7Y2PFL,7Y2PFL,7Y2PFL,7Y2PFL,7Y2PFL,7Y2PFL,7Y2PFL,7Y2PFL,7Y2PFL,7Y2PFL,7Y2PFL,7Y2PFL,7Y2PFL,7Y2PFL,7Y2PFL,7Y2PFL,,,,,,,,,,,,,,,,,,,,,,,,
EYRTZL,EYRTZL,EYRTZL,EYRTZL,EYRTZL,EYRTZL,EYRTZL,EYRTZL,EYRTZL,EYRTZL,EYRTZL,EYRTZL,EYRTZL,EYRTZL,EYRTZL,EYRTZL,EYRTZL,EYRTZL,EYRTZL,EYRTZL,EYRTZL,7Y2PFL,7Y2PFL,7Y2PFL,7Y2PFL,7Y2PFL,7Y2PFL,7Y2PFL,7Y2PFL,7Y2PFL,7Y2PFL,7Y2PFL,7Y2PFL,7Y2PFL,7Y2PFL,7Y2PFL,7Y2PFL,7Y2PFL,7Y2PFL,7Y2PFL,7Y2PFL,7Y2PFL,7Y2PFL,7Y2PFL,7Y2PFL,7Y2PFL,7Y2PFL,7Y2PFL,7Y2PFL,7Y2PFL,7Y2PFL,7Y2PFL,7Y2PFL,7Y2PFL,7Y2PFL,7Y2PFL,,,,,,,,,,,,,,,,,,,,,,,,
EYRTZL,EYRTZL,EYRTZL,EYRTZL,EYRTZL,EYRTZL,EYRTZL,EYRTZL,EYRTZL,EYRTZL,EYRTZL,EYRTZL,EYRTZL,EYRTZL,EYRTZL,EYRTZL,EYRTZL,EYRTZL,EYRTZL,EYRTZL,EYRTZL,7Y2PFL,7Y2PFL,7Y2PFL,7Y2PFL,7Y2PFL,7Y2PFL,7Y2PFL,7Y2PFL,7Y2PFL,7Y2PFL,7Y2PFL,7Y2PFL,7Y2PFL,7Y2PFL,7Y2PFL,7Y2PFL,7Y2PFL,7Y2PFL,7Y2PFL,7Y2PFL,7Y2PFL,7Y2PFL,7Y2PFL,7Y2PFL,7Y2PFL,7Y2PFL,7Y2PFL,7Y2PFL,7Y2PFL,7Y2PFL,7Y2PFL,7Y2PFL,7Y2PFL,7Y2PFL,7Y2PFL,,,,,,,,,,,,,,,,,,,,,,,,
EYRTZL,EYRTZL,EYRTZL,EYRTZL,EYRTZL,EYRTZL,EYRTZL,EYRTZL,EYRTZL,EYRTZL,EYRTZL,EYRTZL,EYRTZL,EYRTZL,EYRTZL,EYRTZL,EYRTZL,EYRTZL,EYRTZL,EYRTZL,EYRTZL,7Y2PFL,7Y2PFL,7Y2PFL,7Y2PFL,7Y2PFL,7Y2PFL,7Y2PFL,7Y2PFL,7Y2PFL,7Y2PFL,7Y2PFL,7Y2PFL,7Y2PFL,7Y2PFL,7Y2PFL,7Y2PFL,7Y2PFL,7Y2PFL,7Y2PFL,7Y2PFL,7Y2PFL,7Y2PFL,7Y2PFL,7Y2PFL,7Y2PFL,7Y2PFL,7Y2PFL,7Y2PFL,7Y2PFL,7Y2PFL,7Y2PFL,7Y2PFL,7Y2PFL,7Y2PFL,7Y2PFL,,,,,,,,,,,,,,,,,,,,,,,,
EYRTZL,EYRTZL,EYRTZL,EYRTZL,EYRTZL,EYRTZL,EYRTZL,EYRTZL,EYRTZL,EYRTZL,EYRTZL,EYRTZL,EYRTZL,EYRTZL,EYRTZL,EYRTZL,EYRTZL,EYRTZL,EYRTZL,EYRTZL,EYRTZL,7Y2PFL,7Y2PFL,7Y2PFL,7Y2PFL,7Y2PFL,7Y2PFL,7Y2PFL,7Y2PFL,7Y2PFL,7Y2PFL,7Y2PFL,7Y2PFL,7Y2PFL,7Y2PFL,7Y2PFL,7Y2PFL,7Y2PFL,7Y2PFL,7Y2PFL,7Y2PFL,7Y2PFL,7Y2PFL,7Y2PFL,7Y2PFL,7Y2PFL,7Y2PFL,7Y2PFL,7Y2PFL,7Y2PFL,7Y2PFL,7Y2PFL,7Y2PFL,7Y2PFL,7Y2PFL,7Y2PFL,,,,,,,,,,,,,,,,,,,,,,,,
EYRTZL,EYRTZL,EYRTZL,EYRTZL,EYRTZL,EYRTZL,EYRTZL,EYRTZL,EYRTZL,EYRTZL,EYRTZL,EYRTZL,EYRTZL,EYRTZL,EYRTZL,EYRTZL,EYRTZL,EYRTZL,EYRTZL,EYRTZL,EYRTZL,7Y2PFL,7Y2PFL,7Y2PFL,7Y2PFL,7Y2PFL,7Y2PFL,7Y2PFL,7Y2PFL,7Y2PFL,7Y2PFL,7Y2PFL,7Y2PFL,7Y2PFL,7Y2PFL,7Y2PFL,7Y2PFL,7Y2PFL,7Y2PFL,7Y2PFL,7Y2PFL,7Y2PFL,7Y2PFL,7Y2PFL,7Y2PFL,7Y2PFL,7Y2PFL,7Y2PFL,7Y2PFL,7Y2PFL,7Y2PFL,7Y2PFL,7Y2PFL,7Y2PFL,7Y2PFL,7Y2PFL,,,,,,,,,,,,,,,,,,,,,,,,
EYRTZL,EYRTZL,EYRTZL,EYRTZL,EYRTZL,EYRTZL,EYRTZL,EYRTZL,EYRTZL,EYRTZL,EYRTZL,EYRTZL,EYRTZL,EYRTZL,EYRTZL,EYRTZL,EYRTZL,EYRTZL,EYRTZL,EYRTZL,EYRTZL,7Y2PFL,7Y2PFL,7Y2PFL,7Y2PFL,7Y2PFL,7Y2PFL,7Y2PFL,7Y2PFL,7Y2PFL,7Y2PFL,7Y2PFL,7Y2PFL,7Y2PFL,7Y2PFL,7Y2PFL,7Y2PFL,7Y2PFL,7Y2PFL,7Y2PFL,7Y2PFL,7Y2PFL,7Y2PFL,7Y2PFL,7Y2PFL,7Y2PFL,7Y2PFL,7Y2PFL,7Y2PFL,7Y2PFL,7Y2PFL,7Y2PFL,7Y2PFL,7Y2PFL,7Y2PFL,7Y2PFL,,,,,,,,,,,,,,,,,,,,,,,,
,,,,,,,,,,,,,,,,,,,,,7Y2PFL,7Y2PFL,7Y2PFL,7Y2PFL,7Y2PFL,7Y2PFL,7Y2PFL,7Y2PFL,7Y2PFL,7Y2PFL,7Y2PFL,7Y2PFL,7Y2PFL,7Y2PFL,7Y2PFL,7Y2PFL,7Y2PFL,7Y2PFL,7Y2PFL,7Y2PFL,7Y2PFL,7Y2PFL,7Y2PFL,7Y2PFL,7Y2PFL,7Y2PFL,7Y2PFL,7Y2PFL,7Y2PFL,7Y2PFL,7Y2PFL,7Y2PFL,7Y2PFL,7Y2PFL,7Y2PFL,,,,,,,,,,,,,,,,,,,,,,,,
NKQX5V,NKQX5V,NKQX5V,NKQX5V,NKQX5V,NKQX5V,NKQX5V,NKQX5V,NKQX5V,NKQX5V,NKQX5V,NKQX5V,NKQX5V,NKQX5V,NKQX5V,NKQX5V,NKQX5V,NKQX5V,NKQX5V,NKQX5V,NKQX5V,NKQX5V,NKQX5V,NKQX5V,NKQX5V,NKQX5V,NKQX5V,NKQX5V,NKQX5V,NKQX5V,NKQX5V,NKQX5V,57973T,57973T,57973T,57973T,57973T,57973T,57973T,57973T,57973T,57973T,57973T,57973T,57973T,57973T,57973T,57973T,57973T,57973T,57973T,57973T,57973T,57973T,57973T,57973T,57973T,57973T,57973T,57973T,57973T,57973T,57973T,57973T,57973T,57973T,,,,,,,,,,,,,,
NKQX5V,NKQX5V,NKQX5V,NKQX5V,NKQX5V,NKQX5V,NKQX5V,NKQX5V,NKQX5V,NKQX5V,NKQX5V,NKQX5V,NKQX5V,NKQX5V,NKQX5V,NKQX5V,NKQX5V,NKQX5V,NKQX5V,NKQX5V,NKQX5V,NKQX5V,NKQX5V,NKQX5V,NKQX5V,NKQX5V,NKQX5V,NKQX5V,NKQX5V,NKQX5V,NKQX5V,NKQX5V,57973T,57973T,57973T,57973T,57973T,57973T,57973T,57973T,57973T,57973T,57973T,57973T,57973T,57973T,57973T,57973T,57973T,57973T,57973T,57973T,57973T,57973T,57973T,57973T,57973T,57973T,57973T,57973T,57973T,57973T,57973T,57973T,57973T,57973T,,,,,,,,,,,,,,
NKQX5V,NKQX5V,NKQX5V,NKQX5V,NKQX5V,NKQX5V,NKQX5V,NKQX5V,NKQX5V,NKQX5V,NKQX5V,NKQX5V,NKQX5V,NKQX5V,NKQX5V,NKQX5V,NKQX5V,NKQX5V,NKQX5V,NKQX5V,NKQX5V,NKQX5V,NKQX5V,NKQX5V,NKQX5V,NKQX5V,NKQX5V,NKQX5V,NKQX5V,NKQX5V,NKQX5V,NKQX5V,57973T,57973T,57973T,57973T,57973T,57973T,57973T,57973T,57973T,57973T,57973T,57973T,57973T,57973T,57973T,57973T,57973T,57973T,57973T,57973T,57973T,57973T,57973T,57973T,57973T,57973T,57973T,57973T,57973T,57973T,57973T,57973T,57973T,57973T,,,,,,,,,,,,,,
NKQX5V,NKQX5V,NKQX5V,NKQX5V,NKQX5V,NKQX5V,NKQX5V,NKQX5V,NKQX5V,NKQX5V,NKQX5V,NKQX5V,NKQX5V,NKQX5V,NKQX5V,NKQX5V,NKQX5V,NKQX5V,NKQX5V,NKQX5V,NKQX5V,NKQX5V,NKQX5V,NKQX5V,NKQX5V,NKQX5V,NKQX5V,NKQX5V,NKQX5V,NKQX5V,NKQX5V,NKQX5V,57973T,57973T,57973T,57973T,57973T,57973T,57973T,57973T,57973T,57973T,57973T,57973T,57973T,57973T,57973T,57973T,57973T,57973T,57973T,57973T,57973T,57973T,57973T,57973T,57973T,57973T,57973T,57973T,57973T,57973T,57973T,57973T,57973T,57973T,,,,,,,,,,,,,,
NKQX5V,NKQX5V,NKQX5V,NKQX5V,NKQX5V,NKQX5V,NKQX5V,NKQX5V,NKQX5V,NKQX5V,NKQX5V,NKQX5V,NKQX5V,NKQX5V,NKQX5V,NKQX5V,NKQX5V,NKQX5V,NKQX5V,NKQX5V,NKQX5V,NKQX5V,NKQX5V,NKQX5V,NKQX5V,NKQX5V,NKQX5V,NKQX5V,NKQX5V,NKQX5V,NKQX5V,NKQX5V,57973T,57973T,57973T,57973T,57973T,57973T,57973T,57973T,57973T,57973T,57973T,57973T,57973T,57973T,57973T,57973T,57973T,57973T,57973T,57973T,57973T,57973T,57973T,57973T,57973T,57973T,57973T,57973T,57973T,57973T,57973T,57973T,57973T,57973T,,,,,,,,,,,,,,
NKQX5V,NKQX5V,NKQX5V,NKQX5V,NKQX5V,NKQX5V,NKQX5V,NKQX5V,NKQX5V,NKQX5V,NKQX5V,NKQX5V,NKQX5V,NKQX5V,NKQX5V,NKQX5V,NKQX5V,NKQX5V,NKQX5V,NKQX5V,NKQX5V,NKQX5V,NKQX5V,NKQX5V,NKQX5V,NKQX5V,NKQX5V,NKQX5V,NKQX5V,NKQX5V,NKQX5V,NKQX5V,57973T,57973T,57973T,57973T,57973T,57973T,57973T,57973T,57973T,57973T,57973T,57973T,57973T,57973T,57973T,57973T,57973T,57973T,57973T,57973T,57973T,57973T,57973T,57973T,57973T,57973T,57973T,57973T,57973T,57973T,57973T,57973T,57973T,57973T,,,,,,,,,,,,,,
NKQX5V,NKQX5V,NKQX5V,NKQX5V,NKQX5V,NKQX5V,NKQX5V,NKQX5V,NKQX5V,NKQX5V,NKQX5V,NKQX5V,NKQX5V,NKQX5V,NKQX5V,NKQX5V,NKQX5V,NKQX5V,NKQX5V,NKQX5V,NKQX5V,NKQX5V,NKQX5V,NKQX5V,NKQX5V,NKQX5V,NKQX5V,NKQX5V,NKQX5V,NKQX5V,NKQX5V,NKQX5V,57973T,57973T,57973T,57973T,57973T,57973T,57973T,57973T,57973T,57973T,57973T,57973T,57973T,57973T,57973T,57973T,57973T,57973T,57973T,57973T,57973T,57973T,57973T,57973T,57973T,57973T,57973T,57973T,57973T,57973T,57973T,57973T,57973T,57973T,,,,,,,,,,,,,,
NKQX5V,NKQX5V,NKQX5V,NKQX5V,NKQX5V,NKQX5V,NKQX5V,NKQX5V,NKQX5V,NKQX5V,NKQX5V,NKQX5V,NKQX5V,NKQX5V,NKQX5V,NKQX5V,NKQX5V,NKQX5V,NKQX5V,NKQX5V,NKQX5V,NKQX5V,NKQX5V,NKQX5V,NKQX5V,NKQX5V,NKQX5V,NKQX5V,NKQX5V,NKQX5V,NKQX5V,NKQX5V,57973T,57973T,57973T,57973T,57973T,57973T,57973T,57973T,57973T,57973T,57973T,57973T,57973T,57973T,57973T,57973T,57973T,57973T,57973T,57973T,57973T,57973T,57973T,57973T,57973T,57973T,57973T,57973T,57973T,57973T,57973T,57973T,57973T,57973T,,,,,,,,,,,,,,
NKQX5V,NKQX5V,NKQX5V,NKQX5V,NKQX5V,NKQX5V,NKQX5V,NKQX5V,NKQX5V,NKQX5V,NKQX5V,NKQX5V,NKQX5V,NKQX5V,NKQX5V,NKQX5V,NKQX5V,NKQX5V,NKQX5V,NKQX5V,NKQX5V,NKQX5V,NKQX5V,NKQX5V,NKQX5V,NKQX5V,NKQX5V,NKQX5V,NKQX5V,NKQX5V,NKQX5V,NKQX5V,57973T,57973T,57973T,57973T,57973T,57973T,57973T,57973T,57973T,57973T,57973T,57973T,57973T,57973T,57973T,57973T,57973T,57973T,57973T,57973T,57973T,57973T,57973T,57973T,57973T,57973T,57973T,57973T,57973T,57973T,57973T,57973T,57973T,57973T,,,,,,,,,,,,,,
NKQX5V,NKQX5V,NKQX5V,NKQX5V,NKQX5V,NKQX5V,NKQX5V,NKQX5V,NKQX5V,NKQX5V,NKQX5V,NKQX5V,NKQX5V,NKQX5V,NKQX5V,NKQX5V,NKQX5V,NKQX5V,NKQX5V,NKQX5V,NKQX5V,NKQX5V,NKQX5V,NKQX5V,NKQX5V,NKQX5V,NKQX5V,NKQX5V,NKQX5V,NKQX5V,NKQX5V,NKQX5V,57973T,57973T,57973T,57973T,57973T,57973T,57973T,57973T,57973T,57973T,57973T,57973T,57973T,57973T,57973T,57973T,57973T,57973T,57973T,57973T,57973T,57973T,57973T,57973T,57973T,57973T,57973T,57973T,57973T,57973T,57973T,57973T,57973T,57973T,,,,,,,,,,,,,,
NKQX5V,NKQX5V,NKQX5V,NKQX5V,NKQX5V,NKQX5V,NKQX5V,NKQX5V,NKQX5V,NKQX5V,NKQX5V,NKQX5V,NKQX5V,NKQX5V,NKQX5V,NKQX5V,NKQX5V,NKQX5V,NKQX5V,NKQX5V,NKQX5V,NKQX5V,NKQX5V,NKQX5V,NKQX5V,NKQX5V,NKQX5V,NKQX5V,NKQX5V,NKQX5V,NKQX5V,NKQX5V,57973T,57973T,57973T,57973T,57973T,57973T,57973T,57973T,57973T,57973T,57973T,57973T,57973T,57973T,57973T,57973T,57973T,57973T,57973T,57973T,57973T,57973T,57973T,57973T,57973T,57973T,57973T,57973T,57973T,57973T,57973T,57973T,57973T,57973T,,,,,,,,,,,,,,
NKQX5V,NKQX5V,NKQX5V,NKQX5V,NKQX5V,NKQX5V,NKQX5V,NKQX5V,NKQX5V,NKQX5V,NKQX5V,NKQX5V,NKQX5V,NKQX5V,NKQX5V,NKQX5V,NKQX5V,NKQX5V,NKQX5V,NKQX5V,NKQX5V,NKQX5V,NKQX5V,NKQX5V,NKQX5V,NKQX5V,NKQX5V,NKQX5V,NKQX5V,NKQX5V,NKQX5V,NKQX5V,57973T,57973T,57973T,57973T,57973T,57973T,57973T,57973T,57973T,57973T,57973T,57973T,57973T,57973T,57973T,57973T,57973T,57973T,57973T,57973T,57973T,57973T,57973T,57973T,57973T,57973T,57973T,57973T,57973T,57973T,57973T,57973T,57973T,57973T,,,,,,,,,,,,,,
NKQX5V,NKQX5V,NKQX5V,NKQX5V,NKQX5V,NKQX5V,NKQX5V,NKQX5V,NKQX5V,NKQX5V,NKQX5V,NKQX5V,NKQX5V,NKQX5V,NKQX5V,NKQX5V,NKQX5V,NKQX5V,NKQX5V,NKQX5V,NKQX5V,NKQX5V,NKQX5V,NKQX5V,NKQX5V,NKQX5V,NKQX5V,NKQX5V,NKQX5V,NKQX5V,NKQX5V,NKQX5V,57973T,57973T,57973T,57973T,57973T,57973T,57973T,57973T,57973T,57973T,57973T,57973T,57973T,57973T,57973T,57973T,57973T,57973T,57973T,57973T,57973T,57973T,57973T,57973T,57973T,57973T,57973T,57973T,57973T,57973T,57973T,57973T,57973T,57973T,,,,,,,,,,,,,,
,,,,,,,,,,,,,,,,,,,,,,,,,,,,,,,,57973T,57973T,57973T,57973T,57973T,57973T,57973T,57973T,57973T,57973T,57973T,57973T,57973T,57973T,57973T,57973T,57973T,57973T,57973T,57973T,57973T,57973T,57973T,57973T,57973T,57973T,57973T,57973T,57973T,57973T,57973T,57973T,57973T,57973T,,,,,,,,,,,,,,
,,,,,,,,,,,,,,,,,,,,,,,,,,,,,,,,,,,,,,,,,,,,,,,,,,,,,,,,,,,,,,,,,,,,,,,,,,,,,,,
,,,,,,,,,,,,,,,,,,,,,,,,,,,,,,,,,,,,,,,,,,,,,,,,,,,,,,,,,,,,,,,,,,,,,,,,,,,,,,,
,,,,,,,,,,,,,,,,,,,,,,,,,,,,,,,,,,,,,,,,,,,,,,,,,,,,,,,,,,,,,,,,,,,,,,,,,,,,,,,
,,,,,,,,,,,,,,,,,,,,,,,,,,,,,,,,,,,,,,,,,,,,,,,,,,,,,,,,,,,,,,,,,,,,,,,,,,,,,,,
,,,,,,,,,,,,,,,,,,,,,,,,,,,,,,,,,,,,,,,,,,,,,,,,,,,,,,,,,,,,,,,,,,,,,,,,,,,,,,,
,,,,,,,,,,,,,,,,,,,,,,,,,,,,,,,,,,,,,,,,,,,,,,,,,,,,,,,,,,,,,,,,,,,,,,,,,,,,,,,
,,,,,,,,,,,,,,,,,,,,,,,,,,,,,,,,,,,,,,,,,,,,,,,,,,,,,,,,,,,,,,,,,,,,,,,,,,,,,,,
,,,,,,,,,,,,,,,,,,,,,,,,,,,,,,,,,,,,,,,,,,,,,,,,,,,,,,,,,,,,,,,,,,,,,,,,,,,,,,,
,,,,,,,,,,,,,,,,,,,,,,,,,,,,,,,,,,,,,,,,,,,,,,,,,,,,,,,,,,,,,,,,,,,,,,,,,,,,,,,
,,,,,,,,,,,,,,,,,,,,,,,,,,,,,,,,,,,,,,,,,,,,,,,,,,,,,,,,,,,,,,,,,,,,,,,,,,,,,,,
,,,,,,,,,,,,,,,,,,,,,,,,,,,,,,,,,,,,,,,,,,,,,,,,,,,,,,,,,,,,,,,,,,,,,,,,,,,,,,,
,,,,,,,,,,,,,,,,,,,,,,,,,,,,,,,,,,,,,,,,,,,,,,,,,,,,,,,,,,,,,,,,,,,,,,,,,,,,,,,
,,,,,,,,,,,,,,,,,,,,,,,,,,,,,,,,,,,,,,,,,,,,,,,,,,,,,,,,,,,,,,,,,,,,,,,,,,,,,,,
,,,,,,,,,,,,,,,,,,,,,,,,,,,,,,,,,,,,,,,,,,,,,,,,,,,,,,,,,,,,,,,,,,,,,,,,,,,,,,,
,,,,,,,,,,,,,,,,,,,,,,,,,,,,,,,,,,,,,,,,,,,,,,,,,,,,,,,,,,,,,,,,,,,,,,,,,,,,,,,
,,,,,,,,,,,,,,,,,,,,,,,,,,,,,,,,,,,,,,,,,,,,,,,,,,,,,,,,,,,,,,,,,,,,,,,,,,,,,,,
,,,,,,,,,,,,,,,,,,,,,,,,,,,,,,,,,,,,,,,,,,,,,,,,,,,,,,,,,,,,,,,,,,,,,,,,,,,,,,,
,,,,,,,,,,,,,,,,,,,,,,,,,,,,,,,,,,,,,,,,,,,,,,,,,,,,,,,,,,,,,,,,,,,,,,,,,,,,,,,
,,,,,,,,,,,,,,,,,,,,,,,,,,,,,,,,,,,,,,,,,,,,,,,,,,,,,,,,,,,,,,,,,,,,,,,,,,,,,,,
,,,,,,,,,,,,,,,,,,,,,,,,,,,,,,,,,,,,,,,,,,,,,,,,,,,,,,,,,,,,,,,,,,,,,,,,,,,,,,,
,,,,,,,,,,,,,,,,,,,,,,,,,,,,,,,,,,,,,,,,,,,,,,,,,,,,,,,,,,,,,,,,,,,,,,,,,,,,,,,
,,,,,,,,,,,,,,,,,,,,,,,,,,,,,,,,,,,,,,,,,,,,,,,,,,,,,,,,,,,,,,,,,,,,,,,,,,,,,,,
